{"text_format":"1","workbook":"xlsx","n_sheets":7,"sheets":["PORTADA","EMPLEADOS","2DA DE DICIEMBRE DEFINITIVA","ACUMULADO","Tablas 2015","Hoja1","finiquito"],"not_rendered":{"charts":0,"images":0,"macros":1,"external_links":4,"defined_names":43,"comments":0,"pivot_tables":0},"unopened":[],"bounds":{"document_bytes":16777216,"sheet_cells":100000,"rows_first":2000,"rows_last":500,"rows_between":2000,"halvings":0,"cell_chars":16384,"cell_head_chars":4096},"cells_cut":0,"cells_raw":0,"read":"whole","date_system":"1900"}

{"sheet":"PORTADA","index":0,"n_rows":42,"n_cols":23,"rows_kept":42,"cut":false,"hidden":false,"merged":[[1,13,1,17],[11,14,11,17],[12,14,12,17],[3,16,4,16],[13,16,13,17],[2,8,2,10],[9,8,9,9],[11,8,11,9],[5,8,5,10],[20,11,20,16]]}
[null,null,null,null,null,null,null,null,null,null,null,null,null,"|",null,null,null,null,null,null,{"$f":"IF($R$21<1,1,\"\")","v":1},"2011-01-01",{"$f":"V2-1","v":"2011-01-15"}]
[null,null,null,null,null,null,null,null,"Usuario:",null,null,null,null,"Simulador de Préstamos…  Inserte los datos requeridos….",null,null,null,null,null,null,{"$f":"IF($R$21<2,2,\"\")","v":2},"2011-01-16","2011-01-31"]
[null,null,null,null,null,null,null,null,null,null,null,null,null,"Tasa de Interes:",0.01,null,"Parcialidad",null,null,null,{"$f":"IF($R$21<3,3,\"\")","v":3},"2011-02-01","2011-02-15"]
[null,null,null,null,null,null,null,null,null,null,null,null,null,"No.de Periodos",4,null,{"$f":"-PMT(O3,O4,O6,,0)","v":256.28109391166043},null,null,null,{"$f":"IF($R$21<4,4,\"\")","v":4},"2011-02-16","2011-02-28"]
[null,null,null,null,null,null,null,null,"Fecha de Trabajo",null,null,null,null,null,null,null,null,null,null,null,{"$f":"IF($R$21<5,5,\"\")","v":5},"2011-03-01","2011-03-15"]
[null,null,null,null,null,null,null,null,{"$f":"NOW()","v":"2016-11-15T14:11:36.270"},null,null,null,null,"Importe del Préstamo:",1000,null,null,null,null,null,{"$f":"IF($R$21<6,6,\"\")","v":6},"2011-03-16","2011-03-31"]
[null,null,null,null,null,null,null,null,null,null,null,null,null,null,null,null,null,null,null,null,{"$f":"IF($R$21<7,7,\"\")","v":7},"2011-04-01","2011-04-15"]
[null,null,"Selecciona La Quincena",null,null,null,null,null,null,null,null,null,null,"Interes Generado",{"$f":"(Q4*O4)-O6","v":25.124375646641738},null,null,null,null,null,{"$f":"IF($R$21<8,8,\"\")","v":8},"2011-04-16","2011-04-30"]
[null,null,null,null,null,null,null,null,null,null,null,null,null,null,null,null,null,null,null,null,{"$f":"IF($R$21<9,9,\"\")","v":9},"2011-05-01","2011-05-15"]
[null,null,null,1,null,null,null,"Desde:",{"$f":"VLOOKUP(D$10,$U1:$W24,2,FALSE)","v":"2011-01-01"},null,null,null,null,"Total a Pagar",{"$f":"O8+O6","v":1025.1243756466417},null,null,null,null,null,{"$f":"IF($R$21<10,10,\"\")","v":10},"2011-05-16","2011-05-31"]
[null,null,null,null,null,null,null,null,null,null,null,null,null,null,null,null,null,null,null,null,{"$f":"IF($R$21<11,11,\"\")","v":11},"2011-06-01","2009-06-15"]
[null,"SUMAS POR CAPITULO",null,null,null,null,null,"Hasta",{"$f":"VLOOKUP(D$10,$U$1:$W24,3,FALSE)","v":"2011-01-15"},null,null,null,null,"Nombre de Deudor:","Juan Perez",null,null,null,null,null,{"$f":"IF($R$21<12,12,\"\")","v":12},"2011-06-16","2009-06-30"]
[null,"CAPITULO",null,"PERCEPCIONES",null,"DEDUCCIONES",null,"NETO A PAGAR",null,null,null,null,null,"Domicilio:","Abasolo",null,null,null,null,null,{"$f":"IF($R$21<13,13,\"\")","v":13},"2011-07-01","2009-07-15"]
[null,1,null,{"$f":"SUMIF(#REF!,$B14,#REF!)","v":{"$error":"#REF!"}},null,{"$f":"SUMIF(#REF!,$B14,#REF!)+SUMIF(#REF!,$B14,#REF!)","v":{"$error":"#REF!"}},null,{"$f":"D14-F14","v":{"$error":"#REF!"}},null,null,null,null,null,"Telefono:",null,"Vencimiento:",null,null,null,null,{"$f":"IF($R$21<14,14,\"\")","v":14},"2011-07-16",{"$f":"V15-1","v":"2011-07-31"}]
[null,2,null,{"$f":"SUMIF(#REF!,$B15,#REF!)","v":{"$error":"#REF!"}},null,{"$f":"SUMIF(#REF!,$B15,#REF!)+SUMIF(#REF!,$B15,#REF!)","v":{"$error":"#REF!"}},null,{"$error":"#REF!"},null,null,null,null,null,null,null,null,null,null,null,null,{"$f":"IF($R$21<15,15,\"\")","v":15},"2011-08-01","2011-08-15"]
[null,3,null,{"$f":"SUMIF(#REF!,$B16,#REF!)","v":{"$error":"#REF!"}},null,{"$f":"SUMIF(#REF!,$B16,#REF!)+SUMIF(#REF!,$B16,#REF!)","v":{"$error":"#REF!"}},null,{"$error":"#REF!"},null,null,null,null,null,null,null,null,null,null,null,null,{"$f":"IF($R$21<16,16,\"\")","v":16},"2011-08-16","2011-08-31"]
[null,4,null,{"$f":"SUMIF(#REF!,$B17,#REF!)","v":{"$error":"#REF!"}},null,{"$f":"SUMIF(#REF!,$B17,#REF!)+SUMIF(#REF!,$B17,#REF!)","v":{"$error":"#REF!"}},null,{"$error":"#REF!"},null,null,null,null,null,null,null,null,null,null,null,null,{"$f":"IF($R$21<17,17,\"\")","v":17},"2011-09-01","2011-09-15"]
[null,5,null,{"$f":"SUMIF(#REF!,$B18,#REF!)","v":{"$error":"#REF!"}},null,{"$f":"SUMIF(#REF!,$B18,#REF!)+SUMIF(#REF!,$B18,#REF!)","v":{"$error":"#REF!"}},null,{"$error":"#REF!"},null,null,null,null,null,null,null,null,null,null,null,null,{"$f":"IF($R$21<18,18,\"\")","v":18},"2011-09-16","2011-09-30"]
[null,11,null,{"$f":"SUMIF(#REF!,$B19,#REF!)","v":{"$error":"#REF!"}},null,{"$f":"SUMIF(#REF!,$B19,#REF!)+SUMIF(#REF!,$B19,#REF!)","v":{"$error":"#REF!"}},null,{"$error":"#REF!"},null,null,null,null,null,null,null,null,null,null,null,null,{"$f":"IF($R$21<19,19,\"\")","v":19},"2011-10-01","2011-10-14"]
[null,null,null,null,null,null,null,null,null,null,null,null,null,null,null,null,null,null,null,null,{"$f":"IF($R$21<20,20,\"\")","v":20},"2011-10-15","2011-10-31"]
{"$rows_left_out":23}
{"sheet":"EMPLEADOS","index":1,"n_rows":162,"n_cols":21,"rows_kept":162,"cut":false,"hidden":false,"merged":[]}
[null,null,null,null,null,null,null,null,null,null,null,null,{"$f":"SUBTOTAL(9,M3:M199)","v":0},null,{"$f":"SUBTOTAL(9,O3:O200)","v":29830.133299999932}]
["No.empleado","CAPITULO","PARTIDA","NOMBRE","RFC","CURP","FECHA DE INGRESO","CARGO","DEPENDENCIA","PAGO CON","DIAS LABORADOS",null,"TIEMPO EXTRA (COMPENSACIONES)","OTROS INGRESOS","SUELDO POR DIA PROPUESTO","FONDO DE AHORRO X DIA (PATRON)","APOYO EDUCACIONAL","SUMA DE PERCEPCIONES","Sueldo X Dia","VERIFICACION"]
[120,1,1,"FREGOSO GOMEZ CARLOS","FEGC520708","FEGC520708HJCRMR08",null,"REGIDOR",1,"TARJETA",15,null,0,0,{"$f":"7714.8/30","v":257.16000000000003},{"$f":"TRUNC($O3*0.04,2)","v":10.28},{"$f":"TRUNC(O3*0.07,2)","v":18},{"$f":"O3+P3+Q3","v":285.44},367.2,{"$f":"VLOOKUP(A3,#REF!,22,FALSE)/15","v":{"$error":"#REF!"}},{"$f":"T3-S3","v":{"$error":"#REF!"}}]
[null,null,null,"RUIZ JUAREZ MARIA RAQUEL",null,null,null,"REGIDOR",1,"TARJETA",15,null,0,0,{"$f":"7714.8/30","v":257.16000000000003},{"$f":"TRUNC($O4*0.04,2)","v":10.28},{"$f":"TRUNC(O4*0.07,2)","v":18},{"$f":"O4+P4+Q4","v":285.44},367.2,{"$f":"VLOOKUP(A4,#REF!,22,FALSE)/15","v":{"$error":"#REF!"}},{"$f":"T4-S4","v":{"$error":"#REF!"}}]
[null,null,null,"PARRA VELASCO ANA ROSA",null,null,null,"REGIDOR",1,"TARJETA",15,null,0,0,257.16000000000003,10.28,18,285.44,367.2,{"$f":"VLOOKUP(A5,#REF!,22,FALSE)/15","v":{"$error":"#REF!"}},{"$error":"#REF!"}]
[null,null,null,"MARTINEZ NAVARRO FRANCISCO",null,null,null,"REGIDOR",1,"TARJETA",15,null,0,0,257.16000000000003,10.28,18,285.44,367.2,{"$f":"VLOOKUP(A6,#REF!,22,FALSE)/15","v":{"$error":"#REF!"}},{"$error":"#REF!"}]
[null,null,null,"SOTO HERNANDEZ RAMON",null,null,null,"REGIDOR",1,"TARJETA",15,null,0,0,257.16000000000003,10.28,18,285.44,367.2,{"$f":"VLOOKUP(A7,#REF!,22,FALSE)/15","v":{"$error":"#REF!"}},{"$error":"#REF!"}]
[null,null,null,"MEDINA FLORES CARMEN AIDE",null,null,null,"REGIDOR",1,"TARJETA",15,null,0,0,257.16000000000003,10.28,18,285.44,367.2,{"$f":"VLOOKUP(A8,#REF!,22,FALSE)/15","v":{"$error":"#REF!"}},{"$error":"#REF!"}]
[null,null,null,"BECERRA GONZALEZ ALFREDO",null,null,null,"REGIDOR",1,"TARJETA",15,null,0,0,257.16000000000003,10.28,18,285.44,367.2,{"$f":"VLOOKUP(A9,#REF!,22,FALSE)/15","v":{"$error":"#REF!"}},{"$error":"#REF!"}]
[null,null,null,"CHAVEZ JORDAN JUAN MANUEL",null,null,null,"REGIDOR",1,"TARJETA",15,null,0,0,257.16000000000003,10.28,18,285.44,367.2,{"$f":"VLOOKUP(A10,#REF!,22,FALSE)/15","v":{"$error":"#REF!"}},{"$error":"#REF!"}]
[null,null,null,"LOPEZ PARRA DANIEL",null,null,null,"REGIDOR",1,"TARJETA",15,null,0,0,257.16000000000003,10.28,18,285.44,367.2,{"$f":"VLOOKUP(A11,#REF!,22,FALSE)/15","v":{"$error":"#REF!"}},{"$error":"#REF!"}]
[]
[]
[]
[]
[]
[]
[]
[]
[1,null,null,"FREGOSO JIMENEZ ESTEBAN",null,null,null,"REGIDOR",1,"SOBRE",15,null,0,0,{"$f":"10884.83/30","v":362.82766666666669},{"$f":"TRUNC($O20*0.04,2)","v":14.51},25.39,402.72766666666666,367.2,{"$f":"VLOOKUP(A20,#REF!,22,FALSE)/15","v":{"$error":"#REF!"}},{"$f":"T20-S20","v":{"$error":"#REF!"}}]
{"$rows_left_out":143}
{"sheet":"2DA DE DICIEMBRE DEFINITIVA","index":2,"n_rows":422,"n_cols":38,"rows_kept":422,"cut":false,"hidden":false,"merged":[[3,1,3,36],[4,1,4,36],[275,33,275,36],[276,33,276,36],[2,0,2,36],[339,3,339,4],[339,15,339,23],[339,33,339,36],[275,3,275,4],[276,3,276,4],[276,15,276,23],[275,15,275,23],[338,3,338,4],[338,15,338,23],[338,33,338,36],[406,0,406,36],[407,1,407,36],[408,1,408,36],[365,3,365,4],[365,15,365,23],[365,33,365,36],[366,3,366,4],[366,15,366,23],[366,33,366,36],[399,3,399,4],[399,15,399,23],[399,33,399,36],[400,3,400,4],[400,15,400,23],[400,33,400,36],[420,3,420,4],[420,15,420,23],[420,33,420,36],[421,3,421,4],[421,15,421,23],[421,33,421,36]]}
[null,null,null,null,null,null,null,null,null,null,null,null,null,null,null,null,null,null,null,{"$f":"SUBTOTAL(9,T9:T334)","v":0},47765.063733333373,2076040.9400000009,83040.629999999903,145321.57999999981,0,228362.2100000004,2076040.9400000009,2304403.1499999985,null,{"$f":"SUBTOTAL(9,AD9:AD334)","v":6198},{"$f":"SUBTOTAL(9,AE9:AE334)","v":0},{"$f":"SUBTOTAL(9,AF9:AF308)","v":{"$error":"#N/A"}},{"$f":"SUBTOTAL(9,AG9:AG334)","v":141653.18999999989},{"$f":"SUBTOTAL(9,AH9:AH334)","v":14319.199999999995},{"$f":"SUBTOTAL(9,AI9:AI334)","v":2179871.1599999969},null,{"$f":"SUBTOTAL(9,AK9:AK308)","v":0}]
[null,null,null,null,null,null,null,null,null,null,null,null,null,null,null,null,null,null,null,null,null,{"$f":"TRUNC(U2*P2,2)","v":0},{"$f":"TRUNC(U2*P2*0.04,2)","v":0},{"$f":"TRUNC(U2*0.07*P2,2)","v":0},{"$f":"S2","v":0},{"$f":"TRUNC(X2+W2+(IF(Y2>519,519,Y2))+IF(R2=0,0,R2*U2),2)","v":0},{"$f":"TRUNC((IF(R2=0,P2*U2,(P2-R2)*U2))+(IF(Y2<519,0,Y2-519)),2)+T2","v":0},{"$f":"Z2+AA2","v":0},{"$f":"W2","v":0},null,null,{"$f":"IF(U2>0.01,(AA2-VLOOKUP(AA2,quincenal,1))*VLOOKUP(AA2,quincenal,3)+VLOOKUP(AA2,quincenal,2)-VLOOKUP(AA2,subquincenal,2),0)","v":0},{"$f":"TRUNC(IF(AF2>0.01,AF2,0),2)","v":0},{"$f":"TRUNC(IF(AF2<0.01,-AF2,0),2)","v":0},{"$f":"AB2-AD2-AE2-AG2+AH2-W2","v":0},{"$f":"PORTADA!$D$10","v":1}]
["H. AYUNTAMIENTO DE ETZATLAN, JALISCO"]
[null,"ADMINISTRACION 2015-2018"]
[null,"NOMINA CORRESPONDIENTE A LA SEGUNDA QUINCENA DE DICIEMBRE DE 2015"]
[null,null,null,"Etzatlán, Jalisco a 30 de Diciembre de 2015."]
[null,"CAPITULO","PARTIDA","NOMBRE","RFC","CURP","FECHA DE INGRESO","CARGO",null,null,null,null,null,null,null,"DIAS LABORADOS","PAGO CON","DIAS CON INCAPACIDAD","TIEMPO EXTRA","OTROS INGRESOS","SUELDO POR DIA PROPUESTO","SUELDO BASE ","FONDO DE AHORRO","APOYO EDUCACIONAL","TIEMPO EXTRA","SUB TOTAL EXENTO","SUB TOTAL GRAVADO","SUB TOTAL A PAGAR","FONDO DE AHORRO ","PRESTAMOS","OTRAS DEDUCCIONES","CALCULO","I.S.R.","SUBSIDIO AL EMPLEO","TOTAL A PAGAR","nomina","FIRMA DE RECIBIDO"]
[null,null,null,"SALA DE REGIDORES"]
[1,1,1,"GOMEZ ALVARADO MA MAGDALENA","FEGC520708","FEGC520708HJCRMR08","2012-10-01","REGIDOR",null,null,null,null,null,null,null,15,"TARJETA",null,0,0,{"$f":"8023/15","v":534.86666666666667},{"$f":"TRUNC(U9*P9,2)","v":8023},{"$f":"TRUNC(U9*P9*0.04,2)","v":320.92},{"$f":"TRUNC(U9*0.07*P9,2)","v":561.61},{"$f":"S9","v":0},{"$f":"TRUNC(X9+W9+(IF(Y9>519,519,Y9))+IF(R9=0,0,R9*U9),2)","v":882.53},{"$f":"TRUNC((IF(R9=0,P9*U9,(P9-R9)*U9))+(IF(Y9<519,0,Y9-519)),2)+T9","v":8023},{"$f":"Z9+AA9","v":8905.5300000000007},null,null,0,{"$f":"IF(U9>0.01,(AA9-VLOOKUP(AA9,quincenal,1))*VLOOKUP(AA9,quincenal,3)+VLOOKUP(AA9,quincenal,2)-VLOOKUP(AA9,subquincenal,2),0)","v":1166.5236240000002},{"$f":"TRUNC(IF(AF9>0.01,AF9,0),2)","v":1166.52},{"$f":"TRUNC(IF(AF9<0.01,-AF9,0),2)","v":0},{"$f":"AB9-AD9-AE9-AG9+AH9","v":7739.01},{"$f":"PORTADA!$D$10","v":1},null,1]
[null,null,null,"COVARRUBIAS VALENCIA JOSE",null,null,null,"REGIDOR",null,null,null,null,null,null,null,15,"TARJETA",null,0,0,{"$f":"8023/15","v":534.86666666666667},{"$f":"TRUNC(U10*P10,2)","v":8023},{"$f":"TRUNC(U10*P10*0.04,2)","v":320.92},{"$f":"TRUNC(U10*0.07*P10,2)","v":561.61},{"$f":"S10","v":0},{"$f":"TRUNC(X10+W10+(IF(Y10>519,519,Y10))+IF(R10=0,0,R10*U10),2)","v":882.53},{"$f":"TRUNC((IF(R10=0,P10*U10,(P10-R10)*U10))+(IF(Y10<519,0,Y10-519)),2)+T10","v":8023},{"$f":"Z10+AA10","v":8905.5300000000007},null,null,0,{"$f":"IF(U10>0.01,(AA10-VLOOKUP(AA10,quincenal,1))*VLOOKUP(AA10,quincenal,3)+VLOOKUP(AA10,quincenal,2)-VLOOKUP(AA10,subquincenal,2),0)","v":1166.5236240000002},{"$f":"TRUNC(IF(AF10>0.01,AF10,0),2)","v":1166.52},{"$f":"TRUNC(IF(AF10<0.01,-AF10,0),2)","v":0},{"$f":"AB10-AD10-AE10-AG10+AH10","v":7739.01},null,null,2]
[3,1,1,"BARAJAS DE LA TORRE ABIGAIL",null,null,"2012-10-01","REGIDOR",null,null,null,null,null,null,null,15,"TARJETA",null,0,0,534.86666666666667,{"$f":"TRUNC(U11*P11,2)","v":8023},{"$f":"TRUNC(U11*P11*0.04,2)","v":320.92},{"$f":"TRUNC(U11*0.07*P11,2)","v":561.61},{"$f":"S11","v":0},{"$f":"TRUNC(X11+W11+(IF(Y11>519,519,Y11))+IF(R11=0,0,R11*U11),2)","v":882.53},{"$f":"TRUNC((IF(R11=0,P11*U11,(P11-R11)*U11))+(IF(Y11<519,0,Y11-519)),2)+T11","v":8023},{"$f":"Z11+AA11","v":8905.5300000000007},null,null,0,{"$f":"IF(U11>0.01,(AA11-VLOOKUP(AA11,quincenal,1))*VLOOKUP(AA11,quincenal,3)+VLOOKUP(AA11,quincenal,2)-VLOOKUP(AA11,subquincenal,2),0)","v":1166.5236240000002},1166.52,{"$f":"TRUNC(IF(AF11<0.01,-AF11,0),2)","v":0},{"$f":"AB11-AD11-AE11-AG11+AH11","v":7739.01},{"$f":"PORTADA!$D$10","v":1},null,3]
[4,1,1,"MELCHOR NAVARRO OBED",null,null,"2012-10-01","REGIDOR",null,null,null,null,null,null,null,15,"TARJETA",null,0,0,534.86666666666667,8023,320.92,561.61,0,882.53,8023,8905.5300000000007,null,null,0,1166.5236240000002,1166.52,0,7739.01,{"$f":"PORTADA!$D$10","v":1},null,4]
[5,1,1,"GOMEZ RICO LUZ ELENA",null,null,"2012-10-01","REGIDOR",null,null,null,null,null,null,null,15,"TARJETA",null,0,0,534.86666666666667,8023,320.92,561.61,0,882.53,8023,8905.5300000000007,null,null,0,1166.5236240000002,1166.52,0,7739.01,{"$f":"PORTADA!$D$10","v":1},null,5]
[6,1,1,"GUTIERREZ GARCIA GERARDO",null,null,"2012-10-01","REGIDOR",null,null,null,null,null,null,null,15,"TARJETA",null,0,0,534.86666666666667,8023,320.92,561.61,0,882.53,8023,8905.5300000000007,null,null,0,1166.5236240000002,1166.52,0,7739.01,{"$f":"PORTADA!$D$10","v":1},null,6]
[7,1,1,"ROBLEDO ORTIZ EDGAR ANTONIO",null,null,"2012-10-01","REGIDOR",null,null,null,null,null,null,null,15,"TARJETA",null,0,0,534.86666666666667,8023,320.92,561.61,0,882.53,8023,8905.5300000000007,null,null,null,1166.5236240000002,1166.52,0,7739.01,{"$f":"PORTADA!$D$10","v":1},null,7]
[8,1,1,"SIERRA ROMERO DOLORES EDITH",null,null,"2012-10-01","REGIDOR",null,null,null,null,null,null,null,15,"TARJETA",null,0,0,534.86666666666667,8023,320.92,561.61,0,882.53,8023,8905.5300000000007,null,null,null,1166.5236240000002,1166.52,0,7739.01,{"$f":"PORTADA!$D$10","v":1},null,8]
[9,1,1,"VELEZ FREGOSO LUIS MANUEL",null,null,"2012-10-01","REGIDOR",null,null,null,null,null,null,null,15,"TARJETA",null,0,0,534.86666666666667,8023,320.92,561.61,0,882.53,8023,8905.5300000000007,null,0,null,1166.5236240000002,1166.52,0,7739.01,{"$f":"PORTADA!$D$10","v":1},null,9]
[null,1,1,null,"BAGV780611","BAGV780611MJCRTR04",null,"SECRETARIA SALA  DE REGIDORES",null,null,null,null,null,null,null,0,"TARJETA",null,0,0,172.16,{"$f":"TRUNC(U18*P18,2)","v":0},0,0,0,0,0,0,null,null,0,null,0,0,0,{"$f":"PORTADA!$D$10","v":1},null,2658.44]
[null,null,null,"SALA DE REGIDORES",null,null,null,null,null,null,null,null,null,null,null,null,null,null,null,null,null,{"$f":"SUM(V9:V18)","v":72207},{"$f":"SUM(W9:W18)","v":2888.28},5054.49,0,7942.7699999999986,72207,80149.77,0,0,0,10498.712616000001,10498.680000000002,0,69651.090000000011,9,0]
[]
{"$rows_left_out":403}
{"sheet":"ACUMULADO","index":3,"n_rows":1,"n_cols":31,"rows_kept":1,"cut":false,"hidden":false,"merged":[]}
["No.empleado","CAPITULO","PARTIDA","NOMBRE","RFC","CURP","FECHA DE INGRESO","CARGO","DEPENDENCIA","PAGO CON","DIAS LABORADOS","DIAS CON INCAPACIDAD","HORAS EXTRAS","DESPENSA EN EFECTIVO","SUELDO POR DIA ACTUAL","SUELDO POR DIA PROPUESTO","FONDO DE AHORRO","APOYO EDUCACIONAL","TIEMPO EXTRA","SUB TOTAL EXENTO","SUB TOTAL GRAVADO","SUB TOTAL A PAGAR","FONDO DE AHORRO","PRESTAMOS","OTRAS DEDUCCIONES","CALCULO","I.S.R.","SUBSIDIO AL EMPLEO","TOTAL A PAGAR","nomina","observaciones"]

{"sheet":"Tablas 2015","index":4,"n_rows":69,"n_cols":16,"rows_kept":69,"cut":false,"hidden":false,"merged":[[18,0,18,1],[18,4,18,5],[18,8,18,9],[19,0,19,1],[19,4,19,5],[19,8,19,9],[0,0,0,2],[0,4,0,6],[0,8,0,10],[1,0,1,2],[1,4,1,6],[1,8,1,10]]}
["TARIFA MENSUAL ISR",null,null,null,"TARIFA QUINCENAL ISR",null,null,null,"TARIFA SEMANAL ISR",null,null,null,0.01,496.07,0,1.92]
[2015,null,null,null,2015,null,null,null,2015,null,null,null,496.08,4210.41,9.52,6.4]
["Lim. Inferior","Cuota Fija","%",null,"Lim. Inferior","Cuota Fija","%",null,"Lim. Inferior","Cuota Fija","%",null,4210.42,7399.42,247.24,10.88]
[0.01,0,1.9199999999999998E-2,null,0.01,0,1.9199999999999998E-2,null,0.01,0,1.9199999999999998E-2,null,7399.43,8601.5,594.21,16]
[496.08,9.52,6.4000000000000001E-2,null,244.81,4.6500000000000004,6.4000000000000001E-2,null,114.25,2.17,6.4000000000000001E-2,null,8601.51,10298.35,786.54,17.920000000000002]
[4210.42,247.24,0.10879999999999999,null,2077.5100000000002,121.95,0.10879999999999999,null,969.51,56.91,0.10879999999999999,null,10298.36,20770.29,1090.6099999999999,21.36]
[7399.43,594.21,0.16,null,3651.01,293.25,0.16,null,1703.81,136.85,0.16,null,20770.3,32736.83,3327.42,23.52]
[8601.51,786.54,0.1792,null,4244.1099999999997,388.05,0.1792,null,1980.59,181.09,0.1792,null,32736.84,62500,6141.95,30]
[10298.36,1090.6099999999999,0.21360000000000001,null,5081.41,538.20000000000005,0.21360000000000001,null,2371.33,251.16,0.21360000000000001,null,62500.01,83333.33,15070.9,32]
[20770.3,3327.42,0.23519999999999999,null,10248.459999999999,1641.75,0.23519999999999999,null,4782.62,766.15,0.23519999999999999,null,83333.34,250000,21737.57,34]
[32736.84,6141.95,0.3,null,16153.06,3030.6,0.3,null,7538.1,1414.28,0.3,null,250000.01,"En adelante",78404.23,35]
[62500.01,15070.9,0.32,null,30838.81,7436.25,0.32,null,14391.45,3470.25,0.32]
[83333.34,21737.57,0.34,null,41118.46,10725.75,0.34,null,19188.62,5005.3500000000004,0.34]
[250000.01,78404.23,0.35,null,123355.21,38686.35,0.35,null,57565.77,18053.63,0.35]
[]
[]
[null,null,null,null,null,null,null,null," "]
[]
["SUBSIDIO PARA EL EMPLEO",null,null,null,"SUBSIDIO PARA EL EMPLEO",null,null,null,"SUBSIDIO PARA EL EMPLEO"]
[{"$f":"+A2","v":2015},null,null,null,{"$f":"+E2","v":2015},null,null,null,{"$f":"+I2","v":2015},null,null,0.01,1768.96,407.02]
{"$rows_left_out":50}
{"sheet":"Hoja1","index":5,"n_rows":0,"n_cols":0,"rows_kept":0,"cut":false,"hidden":false,"merged":[]}

{"sheet":"finiquito","index":6,"n_rows":354,"n_cols":31,"rows_kept":354,"cut":false,"hidden":false,"merged":[[2,0,2,29],[3,1,3,29],[4,1,4,29],[261,3,261,4],[261,8,261,16],[261,26,261,29],[262,3,262,4],[262,8,262,16],[262,26,262,29],[279,3,279,4],[279,8,279,16],[279,26,279,29],[280,3,280,4],[280,8,280,16],[280,26,280,29],[305,3,305,4],[305,8,305,16],[305,26,305,29],[338,3,338,4],[338,8,338,16],[338,26,338,29],[306,3,306,4],[306,8,306,16],[306,26,306,29],[337,3,337,4],[337,8,337,16],[337,26,337,29]]}
[null,null,null,null,null,null,null,null,null,null,null,null,{"$f":"SUBTOTAL(9,M9:M275)","v":0},34262.698166666683,1386197.3899999997,55447.790000000008,97033.710000000021,{"$error":"#REF!"},{"$error":"#REF!"},{"$error":"#REF!"},{"$error":"#REF!"},null,{"$f":"SUBTOTAL(9,W9:W275)","v":0},{"$f":"SUBTOTAL(9,X9:X275)","v":0},{"$f":"SUBTOTAL(9,Y9:Y272)","v":{"$error":"#N/A"}},{"$f":"SUBTOTAL(9,Z9:Z275)","v":102511.26000000001},{"$f":"SUBTOTAL(9,AA9:AA275)","v":11905.069999999998},{"$f":"SUBTOTAL(9,AB9:AB275)","v":1448072.7},null,{"$f":"SUBTOTAL(9,AD9:AD272)","v":0}]
[null,null,null,null,null,null,null,null,null,null,null,null,null,null,{"$f":"TRUNC(N2*I2,2)","v":0},{"$f":"TRUNC(N2*I2*0.04,2)","v":0},{"$f":"TRUNC(N2*0.07*I2,2)","v":0},{"$f":"L2","v":0},{"$f":"TRUNC(Q2+P2+(IF(R2>519,519,R2))+IF(K2=0,0,K2*N2),2)","v":0},{"$f":"TRUNC((IF(K2=0,I2*N2,(I2-K2)*N2))+(IF(R2<519,0,R2-519)),2)+M2","v":0},{"$f":"S2+T2","v":0},{"$f":"P2","v":0},null,null,{"$f":"IF(N2>0.01,(T2-VLOOKUP(T2,quincenal,1))*VLOOKUP(T2,quincenal,3)+VLOOKUP(T2,quincenal,2)-VLOOKUP(T2,subquincenal,2),0)","v":0},{"$f":"TRUNC(IF(Y2>0.01,Y2,0),2)","v":0},{"$f":"TRUNC(IF(Y2<0.01,-Y2,0),2)","v":0},{"$f":"U2-W2-X2-Z2+AA2-P2","v":0},{"$f":"PORTADA!$D$10","v":1}]
["H. AYUNTAMIENTO DE ETZATLAN, JALISCO"]
[null,"ADMINISTRACION 2012-2015"]
[null,"NOMINA CORRESPONDIENTE A LA SEGUNDA QUINCENA DE MAYO DE 2015"]
[null,null,null,"Etzatlán, Jalisco a 30 de Mayo de 2015."]
[null,"CAPITULO","PARTIDA","NOMBRE","RFC","CURP","FECHA DE INGRESO","CARGO","DIAS LABORADOS","PAGO CON","DIAS CON INCAPACIDAD","TIEMPO EXTRA","OTROS INGRESOS","SUELDO POR DIA PROPUESTO","SUELDO BASE ","FONDO DE AHORRO","APOYO EDUCACIONAL","TIEMPO EXTRA","SUB TOTAL EXENTO","SUB TOTAL GRAVADO","SUB TOTAL A PAGAR","FONDO DE AHORRO ","PRESTAMOS","OTRAS DEDUCCIONES","CALCULO","I.S.R.","SUBSIDIO AL EMPLEO","TOTAL A PAGAR","nomina","FIRMA DE RECIBIDO"]
[null,null,null,"SALA DE REGIDORES"]
[1,1,1,"FREGOSO GOMEZ CARLOS","FEGC520708","FEGC520708HJCRMR08","2012-10-01","REGIDOR",15,"TARJETA",null,0,0,{"$f":"8023/15","v":534.86666666666667},{"$f":"TRUNC(N9*I9,2)","v":8023},{"$f":"TRUNC(N9*I9*0.04,2)","v":320.92},{"$f":"TRUNC(N9*0.07*I9,2)","v":561.61},{"$f":"L9","v":0},{"$f":"TRUNC(Q9+P9+(IF(R9>519,519,R9))+IF(K9=0,0,K9*N9),2)","v":882.53},{"$f":"TRUNC((IF(K9=0,I9*N9,(I9-K9)*N9))+(IF(R9<519,0,R9-519)),2)+M9","v":8023},{"$f":"S9+T9","v":8905.5300000000007},null,null,0,{"$f":"IF(N9>0.01,(T9-VLOOKUP(T9,quincenal,1))*VLOOKUP(T9,quincenal,3)+VLOOKUP(T9,quincenal,2)-VLOOKUP(T9,subquincenal,2),0)","v":1166.5236240000002},{"$f":"TRUNC(IF(Y9>0.01,Y9,0),2)","v":1166.52},{"$f":"TRUNC(IF(Y9<0.01,-Y9,0),2)","v":0},{"$f":"U9-W9-X9-Z9+AA9","v":7739.01},{"$f":"PORTADA!$D$10","v":1}]
[null,null,null,"HERNANDEZ ENRIQUEZ J. FILEMON",null,null,null,"REGIDOR",15,"TARJETA",null,0,0,{"$f":"8023/15","v":534.86666666666667},{"$f":"TRUNC(N10*I10,2)","v":8023},{"$f":"TRUNC(N10*I10*0.04,2)","v":320.92},{"$f":"TRUNC(N10*0.07*I10,2)","v":561.61},{"$f":"L10","v":0},{"$f":"TRUNC(Q10+P10+(IF(R10>519,519,R10))+IF(K10=0,0,K10*N10),2)","v":882.53},{"$f":"TRUNC((IF(K10=0,I10*N10,(I10-K10)*N10))+(IF(R10<519,0,R10-519)),2)+M10","v":8023},{"$f":"S10+T10","v":8905.5300000000007},null,null,0,{"$f":"IF(N10>0.01,(T10-VLOOKUP(T10,quincenal,1))*VLOOKUP(T10,quincenal,3)+VLOOKUP(T10,quincenal,2)-VLOOKUP(T10,subquincenal,2),0)","v":1166.5236240000002},1166.52,{"$f":"TRUNC(IF(Y10<0.01,-Y10,0),2)","v":0},{"$f":"U10-W10-X10-Z10+AA10","v":7739.01}]
[3,1,1,"PARRA VELASCO ANA ROSA",null,null,"2012-10-01","REGIDOR",15,"TARJETA",null,0,0,534.86666666666667,8023,320.92,561.61,0,882.53,8023,8905.5300000000007,null,null,0,1166.5236240000002,1166.52,0,7739.01,{"$f":"PORTADA!$D$10","v":1}]
[4,1,1,"MARTINEZ NAVARRO FRANCISCO",null,null,"2012-10-01","REGIDOR",15,"TARJETA",null,0,0,534.86666666666667,8023,320.92,561.61,0,882.53,8023,8905.5300000000007,null,null,0,1166.5236240000002,1166.52,0,7739.01,{"$f":"PORTADA!$D$10","v":1}]
[5,1,1,"SOTO HERNANDEZ RAMON",null,null,"2012-10-01","REGIDOR",15,"TARJETA",null,0,0,534.86666666666667,8023,320.92,561.61,0,882.53,8023,8905.5300000000007,null,null,0,1166.5236240000002,1166.52,0,7739.01,{"$f":"PORTADA!$D$10","v":1}]
[6,1,1,"MEDINA FLORES CARMEN AIDE",null,null,"2012-10-01","REGIDOR",15,"TARJETA",null,0,0,534.86666666666667,8023,320.92,561.61,0,882.53,8023,8905.5300000000007,null,null,0,1166.5236240000002,1166.52,0,7739.01,{"$f":"PORTADA!$D$10","v":1}]
[7,1,1,"BECERRA GONZALEZ ALFREDO",null,null,"2012-10-01","REGIDOR",15,"TARJETA",null,0,0,534.86666666666667,8023,320.92,561.61,0,882.53,8023,8905.5300000000007,null,null,null,1166.5236240000002,1166.52,0,7739.01,{"$f":"PORTADA!$D$10","v":1}]
[8,1,1,"CHAVEZ JORDAN JUAN MANUEL",null,null,"2012-10-01","REGIDOR",15,"TARJETA",null,0,0,534.86666666666667,8023,320.92,561.61,0,882.53,8023,8905.5300000000007,null,null,null,1166.5236240000002,1166.52,0,7739.01,{"$f":"PORTADA!$D$10","v":1}]
[9,1,1,"LOPEZ PARRA DANIEL",null,null,"2012-10-01","REGIDOR",15,"TARJETA",null,0,0,534.86666666666667,8023,320.92,561.61,0,882.53,8023,8905.5300000000007,null,0,null,1166.5236240000002,1166.52,0,7739.01,{"$f":"PORTADA!$D$10","v":1}]
[null,1,1,null,"BAGV780611","BAGV780611MJCRTR04",null,"SECRETARIA SALA  DE REGIDORES",0,"TARJETA",null,0,0,172.16,{"$f":"TRUNC(N18*I18,2)","v":0},0,0,0,0,0,0,null,null,0,null,0,0,0,{"$f":"PORTADA!$D$10","v":1},null,2658.44]
[null,null,null,"SALA DE REGIDORES",null,null,null,null,null,null,null,null,null,null,{"$f":"SUM(O9:O18)","v":72207},{"$f":"SUM(P9:P18)","v":2888.28},5054.49,0,7942.7699999999986,72207,80149.77,0,0,0,10498.712616000001,10498.680000000002,0,69651.090000000011]
[]
{"$rows_left_out":334}